Target
Cathepsin G
Ligand
BDBM50101133
Substrate
Meas. Tech.
ChEBML_45338
IC50
740±n/a nM
Citation
 Aoyama, YUenaka, MKonoike, THayasaki-Kajiwara, YNaya, NNakajima, M Inhibition of serine proteases: activity of 1,3-diazetidine-2,4-diones. Bioorg Med Chem Lett 11:1691-4 (2001)  
Target
Name:
Cathepsin G
Synonyms:
CATG_HUMAN CTSG
Type:
PROTEIN
Mol. Mass.:
28860.08
Organism:
Homo sapiens (Human)
Description:
ChEMBL_1469016
Residue:
255
  
Inhibitor
Name:
BDBM50101133
Synonyms:
1,3-Diethyl-[1,3]diazetidine-2,4-dione | CHEMBL298276
Type:
Small organic molecule
Emp. Form.:
C6H10N2O2
Mol. Mass.:
142.1558
SMILES:
CCN1C(=O)N(CC)C1=O
: