Target
Endothelin-1 receptor
Ligand
BDBM50101249
Substrate
Meas. Tech.
ChEBML_65627
IC50
31±n/a nM
Citation
 Kukkola, PJBilci, NAIkler, TSavage, PShetty, SSDelGrande, DJeng, AY Isoindolines: a new series of potent and selective endothelin-A receptor antagonists. Bioorg Med Chem Lett 11:1737-40 (2001)  
Target
Name:
Endothelin-1 receptor
Synonyms:
EDNRA ET-A ETA-R Endothelin receptor type A hET-AR
Type:
Enzyme Catalytic Domain
Mol. Mass.:
48736.88
Organism:
Homo sapiens (Human)
Description:
P25101
Residue:
427
  
Inhibitor
Name:
BDBM50101249
Synonyms:
CHEMBL301371 | {2-[(1S,3R)-3-Benzo[1,3]dioxol-5-yl-6-ethoxy-2-(1H-tetrazol-5-yl)-2,3-dihydro-1H-isoindol-1-yl]-5-methoxy-phenoxy}-acetic acid
Type:
Small organic molecule
Emp. Form.:
C27H25N5O7
Mol. Mass.:
531.5167
SMILES:
CCOc1ccc2[C@H](N([C@@H](c2c1)c1ccc(OC)cc1OCC(O)=O)c1nnn[nH]1)c1ccc2OCOc2c1
: