Target
Endothelin-1 receptor
Ligand
BDBM50101251
Substrate
Meas. Tech.
ChEBML_65627
IC50
85±n/a nM
Citation
 Kukkola, PJBilci, NAIkler, TSavage, PShetty, SSDelGrande, DJeng, AY Isoindolines: a new series of potent and selective endothelin-A receptor antagonists. Bioorg Med Chem Lett 11:1737-40 (2001)  
Target
Name:
Endothelin-1 receptor
Synonyms:
EDNRA ET-A ETA-R Endothelin receptor type A hET-AR
Type:
Enzyme Catalytic Domain
Mol. Mass.:
48736.88
Organism:
Homo sapiens (Human)
Description:
P25101
Residue:
427
  
Inhibitor
Name:
BDBM50101251
Synonyms:
CHEMBL300000 | [(1R,3S)-1-Benzo[1,3]dioxol-5-yl-3-(2-carboxymethoxy-3-methoxy-phenyl)-5-ethoxy-1,3-dihydro-isoindol-2-yl]-acetic acid
Type:
Small organic molecule
Emp. Form.:
C28H27NO9
Mol. Mass.:
521.5153
SMILES:
CCOc1ccc2[C@H](N(CC(O)=O)[C@@H](c2c1)c1cccc(OC)c1OCC(O)=O)c1ccc2OCOc2c1
: