Target
5-hydroxytryptamine receptor 2C
Ligand
BDBM85097
Substrate
Meas. Tech.
ChEMBL_1991783 (CHEMBL4625518)
IC50
0.330000±n/a nM
Citation
 Evans, CAZuluaga, AVasquez Matute, DBaradaran-Noviri, SPerez-Cervantes, NSiegler, MA Synthesis and biological evaluation of thioadatanserin and its dialkylated products as partial 5-HTR Bioorg Med Chem Lett 30:0 (2020)  
Target
Name:
5-hydroxytryptamine receptor 2C
Synonyms:
5-HT-2C 5-HT2C-INI 5-HTR2C 5-hydroxytryptamine receptor 2C (5-HT-2C) 5HT-1C HTR1C Serotonin (5-HT3) receptor Serotonin Receptor 2C
Type:
G Protein-Coupled Receptor (GPCR)
Mol. Mass.:
51836.79
Organism:
Homo sapiens (Human)
Description:
P28335
Residue:
458
  
Inhibitor
Name:
BDBM85097
Synonyms:
CAS_181632-25-7 SB 242084
Type:
Small organic molecule
Emp. Form.:
C21H19ClN4O2
Mol. Mass.:
394.854
SMILES:
Cc1cc2CCN(C(=O)Nc3ccc(Oc4cccnc4C)nc3)c2cc1Cl
: