Target
Delta-type opioid receptor
Ligand
BDBM50101628
Substrate
Meas. Tech.
ChEMBL_145325 (CHEMBL750413)
IC50
0.410000±n/a nM
Citation
 Pagé, DNaismith, ASchmidt, RCoupal, MLabarre, MGosselin, MBellemare, DPayza, KBrown, W Novel C-terminus modifications of the Dmt-Tic motif: a new class of dipeptide analogues showing altered pharmacological profiles toward the opioid receptors. J Med Chem 44:2387-90 (2001)  
Target
Name:
Delta-type opioid receptor
Synonyms:
D-OR-1 Delta opioid receptor OPIATE Delta OPRD1 OPRK1 | opioid receptor, delta 1
Type:
G Protein-Coupled Receptor (GPCR)
Mol. Mass.:
40382.98
Organism:
Homo sapiens (Human)
Description:
Competition binding assays were carried out using membrane preparations from transfected HN9.10 cells that constitutively expressed the delta opioid receptor.
Residue:
372
  
Inhibitor
Name:
BDBM50101628
Synonyms:
2-Amino-1-[3-(benzylamino-methyl)-3,4-dihydro-1H-isoquinolin-2-yl]-3-(4-hydroxy-2,6-dimethyl-phenyl)-propan-1-one | CHEMBL77001
Type:
Small organic molecule
Emp. Form.:
C28H33N3O2
Mol. Mass.:
443.5805
SMILES:
Cc1cc(O)cc(C)c1C[C@H](N)C(=O)N1Cc2ccccc2C[C@H]1CNCc1ccccc1
: