Target
TYR_PHOSPHATASE_2 domain-containing protein
Ligand
BDBM50544439
Substrate
Meas. Tech.
ChEMBL_1992557 (CHEMBL4626292)
IC50
35±n/a nM
Citation
 Ruddraraju, KVAggarwal, DNiu, CBaker, EAZhang, RYWu, LZhang, ZY Highly Potent and Selective  J Med Chem 63:9212-9227 (2020)  
Target
Name:
TYR_PHOSPHATASE_2 domain-containing protein
Synonyms:
(PROTEIN-TYROSINE-PHOSPHATASE) (PTPase) PHOSPHOTYROSINE PROTEIN PHOSPHATASE PTPB Phosphotyrosine-protein phosphatase PTPB | Protein Tyrosine Phosphatase PTPB
Type:
Hydrolase
Mol. Mass.:
30152.45
Organism:
Mycobacterium tuberculosis
Description:
Residue:
276
  
Inhibitor
Name:
BDBM50544439
Synonyms:
CHEMBL4646506 | US11192850, Entry 4s
Type:
Small organic molecule
Emp. Form.:
C21H20N2O5
Mol. Mass.:
380.3939
SMILES:
CC(C)(C)OC(=O)Nc1ccc(cc1)C#Cc1ccc(NC(=O)C(O)=O)cc1
: