Target
TYR_PHOSPHATASE_2 domain-containing protein
Ligand
BDBM50544440
Substrate
Meas. Tech.
ChEMBL_1992557 (CHEMBL4626292)
IC50
6.4±n/a nM
Citation
 Ruddraraju, KVAggarwal, DNiu, CBaker, EAZhang, RYWu, LZhang, ZY Highly Potent and Selective  J Med Chem 63:9212-9227 (2020)  
Target
Name:
TYR_PHOSPHATASE_2 domain-containing protein
Synonyms:
(PROTEIN-TYROSINE-PHOSPHATASE) (PTPase) PHOSPHOTYROSINE PROTEIN PHOSPHATASE PTPB Phosphotyrosine-protein phosphatase PTPB | Protein Tyrosine Phosphatase PTPB
Type:
Hydrolase
Mol. Mass.:
30152.45
Organism:
Mycobacterium tuberculosis
Description:
Residue:
276
  
Inhibitor
Name:
BDBM50544440
Synonyms:
CHEMBL4647367 | US11192850, Entry 4t
Type:
Small organic molecule
Emp. Form.:
C17H9ClF3NO3
Mol. Mass.:
367.706
SMILES:
OC(=O)C(=O)Nc1ccc(cc1)C#Cc1ccc(cc1Cl)C(F)(F)F
: