Target
Prostaglandin E2 receptor EP2 subtype
Ligand
BDBM50101848
Substrate
Meas. Tech.
ChEBML_158310
Ki
14±n/a nM
Citation
 Maruyama, TAsada, MShiraishi, TIshida, AEgashira, HYoshida, HMaruyama, TOhuchida, SNakai, HKondo, KToda, M Design and synthesis of a highly selective EP4-receptor agonist. Part 1: 3,7-dithiaPG derivatives with high selectivity. Bioorg Med Chem Lett 11:2029-31 (2001)  
Target
Name:
Prostaglandin E2 receptor EP2 subtype
Synonyms:
PE2R2_MOUSE Prostaglandin E2 Prostanoid EP2 receptor Ptgerep2
Type:
G-protein coupled receptor
Mol. Mass.:
40495.26
Organism:
Mus musculus (Mouse)
Description:
Residue:
362
  
Inhibitor
Name:
BDBM50101848
Synonyms:
6-[(1R,2S,3R)-3-Hydroxy-2-((E)-(3S,5S)-3-hydroxy-5-methyl-non-1-enyl)-5-oxo-cyclopentylsulfanyl]-hexanoic acid | CHEMBL64854
Type:
Small organic molecule
Emp. Form.:
C21H36O5S
Mol. Mass.:
400.573
SMILES:
CCCC[C@H](C)C[C@H](O)\C=C\[C@H]1[C@H](O)CC(=O)[C@@H]1SCCCCCC(O)=O
: