Target
Prostaglandin E2 receptor EP3 subtype
Ligand
BDBM50101836
Substrate
Meas. Tech.
ChEBML_158324
Ki
4.5±n/a nM
Citation
 Maruyama, TAsada, MShiraishi, TIshida, AEgashira, HYoshida, HMaruyama, TOhuchida, SNakai, HKondo, KToda, M Design and synthesis of a highly selective EP4-receptor agonist. Part 1: 3,7-dithiaPG derivatives with high selectivity. Bioorg Med Chem Lett 11:2029-31 (2001)  
Target
Name:
Prostaglandin E2 receptor EP3 subtype
Synonyms:
PE2R3_MOUSE Prostaglandin E2 receptor EP3 isoform alpha Prostanoid EP3 receptor Ptgerep3
Type:
G-protein coupled receptor
Mol. Mass.:
40092.50
Organism:
Mus musculus (Mouse)
Description:
Residue:
365
  
Inhibitor
Name:
BDBM50101836
Synonyms:
6-[(S)-(R)-3-Hydroxy-2-((1S,2R)-3-hydroxy-oct-1-enyl)-5-oxo-cyclopentylsulfanyl]-hexanoic acid | CHEMBL294108
Type:
Small organic molecule
Emp. Form.:
C19H32O5S
Mol. Mass.:
372.519
SMILES:
CCCCC[C@H](O)\C=C\[C@H]1[C@H](O)CC(=O)[C@@H]1SCCCCCC(O)=O
: