Target
Prostaglandin E2 receptor EP4 subtype
Ligand
BDBM50101849
Substrate
Meas. Tech.
ChEMBL_158450 (CHEMBL763254)
Ki
3.2±n/a nM
Citation
 Maruyama, TAsada, MShiraishi, TIshida, AEgashira, HYoshida, HMaruyama, TOhuchida, SNakai, HKondo, KToda, M Design and synthesis of a highly selective EP4-receptor agonist. Part 1: 3,7-dithiaPG derivatives with high selectivity. Bioorg Med Chem Lett 11:2029-31 (2001)  
Target
Name:
Prostaglandin E2 receptor EP4 subtype
Synonyms:
PE2R4_MOUSE Prostanoid EP4 receptor Ptgerep4
Type:
G-protein coupled receptor
Mol. Mass.:
56175.66
Organism:
Mus musculus (Mouse)
Description:
Residue:
513
  
Inhibitor
Name:
BDBM50101849
Synonyms:
3-{2-[(S)-(R)-3-Hydroxy-2-((1S,2R)-3-hydroxy-oct-1-enyl)-5-oxo-cyclopentylsulfanyl]-ethylsulfanyl}-propionic acid | CHEMBL304887
Type:
Small organic molecule
Emp. Form.:
C18H30O5S2
Mol. Mass.:
390.558
SMILES:
CCCCC[C@H](O)\C=C\[C@H]1[C@H](O)CC(=O)[C@@H]1SCCSCCC(O)=O
: