Target
Alpha-1A adrenergic receptor
Ligand
BDBM50090304
Substrate
Meas. Tech.
ChEBML_33742
Ki
17±n/a nM
Citation
 DiPardo, RMPatane, MANewton, RCPrice, RBroten, TPChang, RSRansom, RWDi Salvo, JFreidinger, RMBock, MG Cyclic imides as potent and selective alpha-1A adrenergic receptor antagonists. Bioorg Med Chem Lett 11:1959-62 (2001)  
Target
Name:
Alpha-1A adrenergic receptor
Synonyms:
ADA1A_HUMAN ADRA1C Alpha 1A-adrenoceptor Alpha adrenergic receptor 1a Alpha-adrenergic receptor 1c adrenergic Alpha1 | adrenergic Alpha1C
Type:
Cell-surface receptors
Mol. Mass.:
51511.67
Organism:
Homo sapiens (Human)
Description:
P35348
Residue:
466
  
Inhibitor
Name:
BDBM50090304
Synonyms:
1-[3-(2,2-Di-p-tolyl-acetylamino)-propyl]-4-phenyl-piperidine-4-carboxylic acid methyl ester | CHEMBL41677
Type:
Small organic molecule
Emp. Form.:
C32H38N2O3
Mol. Mass.:
498.6557
SMILES:
COC(=O)C1(CCN(CCCNC(=O)C(c2ccc(C)cc2)c2ccc(C)cc2)CC1)c1ccccc1
: