Target
Alpha-1D adrenergic receptor
Ligand
BDBM50090304
Substrate
Meas. Tech.
ChEBML_32454
Ki
975±n/a nM
Citation
 DiPardo, RMPatane, MANewton, RCPrice, RBroten, TPChang, RSRansom, RWDi Salvo, JFreidinger, RMBock, MG Cyclic imides as potent and selective alpha-1A adrenergic receptor antagonists. Bioorg Med Chem Lett 11:1959-62 (2001)  
Target
Name:
Alpha-1D adrenergic receptor
Synonyms:
ADA1D_HUMAN ADRA1D Adrenergic receptor alpha Alpha 1D-adrenoreceptor Alpha-1D adrenoceptor adrenergic Alpha1D
Type:
Enzyme Catalytic Domain
Mol. Mass.:
60485.82
Organism:
Homo sapiens (Human)
Description:
adrenergic Alpha1D ADRA1D HUMAN::P25100
Residue:
572
  
Inhibitor
Name:
BDBM50090304
Synonyms:
1-[3-(2,2-Di-p-tolyl-acetylamino)-propyl]-4-phenyl-piperidine-4-carboxylic acid methyl ester | CHEMBL41677
Type:
Small organic molecule
Emp. Form.:
C32H38N2O3
Mol. Mass.:
498.6557
SMILES:
COC(=O)C1(CCN(CCCNC(=O)C(c2ccc(C)cc2)c2ccc(C)cc2)CC1)c1ccccc1
: