Target
Integrin alpha-V/beta-3
Ligand
BDBM50545182
Substrate
Meas. Tech.
ChEMBL_1994468 (CHEMBL4628363)
IC50
72±n/a nM
Citation
 Meena, CLSingh, DWeinmüller, MReichart, FDangi, AMarelli, UKZahler, SSanjayan, GJ Novel cilengitide-based cyclic RGD peptides as ?v? Bioorg Med Chem Lett 30:0 (2020)  
Target
Name:
Integrin alpha-V/beta-3
Synonyms:
ITGAV/ITGB3 | Integrin beta-3/Vitronectin receptor alpha
Type:
Enzyme
Mol. Mass.:
Description:
Components:
This complex has 2 components.
Component 1
Name:
Integrin alpha-V
Synonyms:
ITAV_HUMAN Integrin alpha-V/alpha-5 VNRA Vitronectin receptor | Vitronectin receptor subunit alpha
Type:
PROTEIN
Mol. Mass.:
116024.92
Organism:
Homo sapiens (Human)
Description:
ChEMBL_582336
Residue:
1048
  
Component 2
Name:
Integrin beta-3
Synonyms:
CD_antigen=CD61 GPIIIa ITGB3 Platelet membrane glycoprotein IIIa
Type:
Protein
Mol. Mass.:
87038.91
Organism:
Homo sapiens (Human)
Description:
P05106
Residue:
788
  
Inhibitor
Name:
BDBM50545182
Synonyms:
CHEMBL4636873
Type:
Small organic molecule
Emp. Form.:
C31H37F3N8O10
Mol. Mass.:
738.6683
SMILES:
OC(=O)C(F)(F)F.COc1c2NC(=O)[C@@H](Cc3ccccc3)NC(=O)[C@H](CC(O)=O)NC(=O)CNC(=O)[C@H](CCCNC(N)=N)NC(=O)c1ccc2
: