Target
Integrin alpha-V/beta-5
Ligand
BDBM50545181
Substrate
Meas. Tech.
ChEMBL_1994469 (CHEMBL4628364)
IC50
50±n/a nM
Citation
 Meena, CLSingh, DWeinmüller, MReichart, FDangi, AMarelli, UKZahler, SSanjayan, GJ Novel cilengitide-based cyclic RGD peptides as ?v? Bioorg Med Chem Lett 30:0 (2020)  
Target
Name:
Integrin alpha-V/beta-5
Synonyms:
ITGAV/ITGB5 | Integrin beta-5/Vitronectin receptor alpha
Type:
Enzyme
Mol. Mass.:
Description:
Components:
This complex has 2 components.
Component 1
Name:
Integrin alpha-V
Synonyms:
ITAV_HUMAN Integrin alpha-V/alpha-5 VNRA Vitronectin receptor | Vitronectin receptor subunit alpha
Type:
PROTEIN
Mol. Mass.:
116024.92
Organism:
Homo sapiens (Human)
Description:
ChEMBL_582336
Residue:
1048
  
Component 2
Name:
Integrin beta-5
Synonyms:
ITB5_HUMAN | ITGB5
Type:
PROTEIN
Mol. Mass.:
88047.37
Organism:
Homo sapiens (Human)
Description:
EBI_10915
Residue:
799
  
Inhibitor
Name:
BDBM50545181
Synonyms:
CHEMBL4633117
Type:
Small organic molecule
Emp. Form.:
C27H37F3N8O9
Mol. Mass.:
674.6261
SMILES:
OC(=O)C(F)(F)F.CC1(C)NC(=O)[C@@H](Cc2ccccc2)NC(=O)[C@H](CC(O)=O)NC(=O)CNC(=O)[C@H](CCCNC(N)=N)NC1=O
: