Target
Integrin alpha-V/beta-8
Ligand
BDBM50545182
Substrate
Meas. Tech.
ChEMBL_1994471 (CHEMBL4628366)
IC50
6875±n/a nM
Citation
 Meena, CLSingh, DWeinmüller, MReichart, FDangi, AMarelli, UKZahler, SSanjayan, GJ Novel cilengitide-based cyclic RGD peptides as ?v? Bioorg Med Chem Lett 30:0 (2020)  
Target
Name:
Integrin alpha-V/beta-8
Synonyms:
ITGAV/ITGB8 Integrin alpha-V/beta-8 | Integrin alphavbeta8
Type:
Enzyme
Mol. Mass.:
Description:
Components:
This complex has 2 components.
Component 1
Name:
Integrin alpha-V
Synonyms:
ITAV_HUMAN Integrin alpha-V/alpha-5 VNRA Vitronectin receptor | Vitronectin receptor subunit alpha
Type:
PROTEIN
Mol. Mass.:
116024.92
Organism:
Homo sapiens (Human)
Description:
ChEMBL_582336
Residue:
1048
  
Component 2
Name:
Integrin beta-8
Synonyms:
ITB8_HUMAN | ITGB8
Type:
Protein
Mol. Mass.:
85643.68
Organism:
Homo sapiens (Human)
Description:
Residue:
769
  
Inhibitor
Name:
BDBM50545182
Synonyms:
CHEMBL4636873
Type:
Small organic molecule
Emp. Form.:
C31H37F3N8O10
Mol. Mass.:
738.6683
SMILES:
OC(=O)C(F)(F)F.COc1c2NC(=O)[C@@H](Cc3ccccc3)NC(=O)[C@H](CC(O)=O)NC(=O)CNC(=O)[C@H](CCCNC(N)=N)NC(=O)c1ccc2
: