Target
Integrin alpha-IIb/beta-3
Ligand
BDBM50545182
Substrate
Meas. Tech.
ChEMBL_1994473 (CHEMBL4628368)
IC50
4864±n/a nM
Citation
 Meena, CLSingh, DWeinmüller, MReichart, FDangi, AMarelli, UKZahler, SSanjayan, GJ Novel cilengitide-based cyclic RGD peptides as ?v? Bioorg Med Chem Lett 30:0 (2020)  
Target
Name:
Integrin alpha-IIb/beta-3
Synonyms:
Glycoprotein IIb/IIIa
Type:
Mol. Mass.:
Description:
ASSAY_ID of EBI is 30109
Components:
This complex has 2 components.
Component 1
Name:
Integrin beta-3
Synonyms:
CD_antigen=CD61 GPIIIa ITGB3 Platelet membrane glycoprotein IIIa
Type:
Protein
Mol. Mass.:
87038.91
Organism:
Homo sapiens (Human)
Description:
P05106
Residue:
788
  
Component 2
Name:
Integrin alpha-IIb
Synonyms:
CD_antigen=CD41 GPIIb Glycoprotein IIb ITGA2B Integrin alpha-IIb heavy chain Integrin alpha-IIb light chain, form 2 Integrin alpha-V/beta-3 and alpha-IIb/beta 3 | Platelet membrane glycoprotein IIb
Type:
Protein
Mol. Mass.:
113354.85
Organism:
Homo sapiens (Human)
Description:
P08514
Residue:
1039
  
Inhibitor
Name:
BDBM50545182
Synonyms:
CHEMBL4636873
Type:
Small organic molecule
Emp. Form.:
C31H37F3N8O10
Mol. Mass.:
738.6683
SMILES:
OC(=O)C(F)(F)F.COc1c2NC(=O)[C@@H](Cc3ccccc3)NC(=O)[C@H](CC(O)=O)NC(=O)CNC(=O)[C@H](CCCNC(N)=N)NC(=O)c1ccc2
: