Target
Nuclear receptor ROR-alpha
Ligand
BDBM50545540
Substrate
Meas. Tech.
ChEMBL_1995433 (CHEMBL4629328)
EC50
8400±n/a nM
Citation
 Harikrishnan, LSGill, PKamau, MGQin, LYRuan, ZO'Malley, DHuynh, TStachura, SCavallaro, CLLu, ZJ-W Duan, JWeigelt, CASack, JSRuzanov, MKhan, JGururajan, MWong, JJHuang, YYarde, MLi, ZChen, CSun, HBorowski, VMurtaza, AFink, BE Substituted benzyloxytricyclic compounds as retinoic acid-related orphan receptor gamma t (ROR?t) agonists. Bioorg Med Chem Lett 30:0 (2020)  
Target
Name:
Nuclear receptor ROR-alpha
Synonyms:
NR1F1 Nuclear receptor subfamily 1 group F member 1 RORA RZRA | Retinoid-related orphan receptor-alpha
Type:
PROTEIN
Mol. Mass.:
58976.26
Organism:
Homo sapiens (Human)
Description:
ChEMBL_101591
Residue:
523
  
Inhibitor
Name:
BDBM50545540
Synonyms:
CHEMBL4644223
Type:
Small organic molecule
Emp. Form.:
C34H32F5NO6S
Mol. Mass.:
677.678
SMILES:
[H][C@@]12CCc3cc(OCc4c(F)cccc4C(F)(F)F)ccc3[C@@]1(CCN2C(=O)[C@H]1CC[C@@H](CC1)C(O)=O)S(=O)(=O)c1ccc(F)cc1
: