Target
Retinoic acid receptor RXR-alpha
Ligand
BDBM50301375
Substrate
Meas. Tech.
ChEMBL_1995681 (CHEMBL4629576)
EC50
15400±n/a nM
Citation
 Gellrich, LHeitel, PHeering, JKilu, WPollinger, JGoebel, TKahnt, AArifi, SPogoda, WPaulke, ASteinhilber, DProschak, EWurglics, MSchubert-Zsilavecz, MChaikuad, AKnapp, SBischoff, IFürst, RMerk, D l-Thyroxin and the Nonclassical Thyroid Hormone TETRAC Are Potent Activators of PPAR?. J Med Chem 63:6727-6740 (2020)  
Target
Name:
Retinoic acid receptor RXR-alpha
Synonyms:
NR2B1 Nuclear receptor subfamily 4 group A member 2 RXRA Retinoic acid receptor RXR-alpha/gamma Retinoid receptor
Type:
PROTEIN
Mol. Mass.:
50820.38
Organism:
Homo sapiens (Human)
Description:
ChEMBL_1456363
Residue:
462
  
Inhibitor
Name:
BDBM50301375
Synonyms:
3,3',5,5'-tetraiodo-L-thyronine 4-(4-hydroxy-3,5-diiodophenoxy)-3,5-diiodo-L-phenylalanine L-T4 O-(4-hydroxy-3,5-diiodophenyl)-3,5-diiodo-L-tyrosine | levothyroxine
Type:
Small organic molecule
Emp. Form.:
C15H11I4NO4
Mol. Mass.:
776.87
SMILES:
N[C@@H](Cc1cc(I)c(Oc2cc(I)c(O)c(I)c2)c(I)c1)C(O)=O
: