Target
Fructose-1,6-bisphosphatase 1
Ligand
BDBM26655
Substrate
Meas. Tech.
ChEMBL_1995781 (CHEMBL4629676)
IC50
24000±n/a nM
Citation
 Proença, COliveira, AFreitas, MRibeiro, DSousa, JLCRamos, MJSilva, AMSFernandes, PAFernandes, E Structural Specificity of Flavonoids in the Inhibition of Human Fructose 1,6-Bisphosphatase. J Nat Prod 83:1541-1552 (2020)  
Target
Name:
Fructose-1,6-bisphosphatase 1
Synonyms:
D-fructose-1,6-bisphosphate 1-phosphohydrolase 1 FBP FBPase 1 Fructose-1,6-bisphosphatase 1 | Fructose-1,6-bisphosphatase 1 (FBPase)
Type:
Protein
Mol. Mass.:
36843.58
Organism:
Homo sapiens (Human)
Description:
Liver FBPase (P09467)
Residue:
338
  
Inhibitor
Name:
BDBM26655
Synonyms:
2-(3,4-dihydroxyphenyl)-3,5,7,8-tetrahydroxy-4H-chromen-4-one Gossypetin (23) | gossypetin
Type:
Flavonoid
Emp. Form.:
C15H10O8
Mol. Mass.:
318.2351
SMILES:
Oc1ccc(cc1O)-c1oc2c(O)c(O)cc(O)c2c(=O)c1O
: