Target
Delta-type opioid receptor
Ligand
BDBM50545677
Substrate
Meas. Tech.
ChEMBL_1996171 (CHEMBL4630066)
IC50
0.390000±n/a nM
Citation
 Vekariya, RHLei, WRay, ASaini, SKZhang, SMolnar, GBarlow, DKarlage, KLBilsky, EJHouseknecht, KLLargent-Milnes, TMStreicher, JMAnanthan, S Synthesis and Structure-Activity Relationships of 5'-Aryl-14-alkoxypyridomorphinans: Identification of a ? Opioid Receptor Agonist/? Opioid Receptor Antagonist Ligand with Systemic Antinociceptive Activity and Diminished Opioid Side Effects. J Med Chem 63:7663-7694 (2020)  
Target
Name:
Delta-type opioid receptor
Synonyms:
D-OR-1 Delta opioid receptor OPIATE Delta OPRD1 OPRK1 | opioid receptor, delta 1
Type:
G Protein-Coupled Receptor (GPCR)
Mol. Mass.:
40382.98
Organism:
Homo sapiens (Human)
Description:
Competition binding assays were carried out using membrane preparations from transfected HN9.10 cells that constitutively expressed the delta opioid receptor.
Residue:
372
  
Inhibitor
Name:
BDBM50545677
Synonyms:
CHEMBL4645508
Type:
Small organic molecule
Emp. Form.:
C38H39N3O3
Mol. Mass.:
585.7346
SMILES:
[H][C@@]12Oc3c4c(C[C@@]5([H])N(CC6CC6)CC[C@@]14[C@]5(Cc1cc(cnc21)-c1ccnc(C)c1)OCCCc1ccccc1)ccc3O
: