Target
Tyrosine-protein kinase ZAP-70
Ligand
BDBM50103778
Substrate
Meas. Tech.
ChEBML_217759
IC50
>500000±n/a nM
Citation
 Kawahata, NYang, MGLuke, GPShakespeare, WCSundaramoorthi, RWang, YJohnson, DMerry, TViolette, SGuan, WBartlett, CSmith, JHatada, MLu, XDalgarno, DCEyermann, CJBohacek, RSSawyer, TK A novel phosphotyrosine mimetic 4'-carboxymethyloxy-3'-phosphonophenylalanine (Cpp): exploitation in the design of nonpeptide inhibitors of pp60(Src) SH2 domain. Bioorg Med Chem Lett 11:2319-23 (2001)  
Target
Name:
Tyrosine-protein kinase ZAP-70
Synonyms:
70 kDa zeta-associated protein Syk-related tyrosine kinase Tyrosine-protein kinase ZAP-70 Tyrosine-protein kinase ZAP-70 (ZAP70) ZAP70 Zeta-chain (TCR) associated protein kinase 70kDa
Type:
Enzyme
Mol. Mass.:
69881.61
Organism:
Homo sapiens (Human)
Description:
ZAP-70 SH2 domain was expressed and purified from E. coli using O-phospho-L-tyrosine-agarose column.
Residue:
619
  
Inhibitor
Name:
BDBM50103778
Synonyms:
CHEMBL311114 | [5-{2-[1-(3-Carbamoyl-4-cyclohexylmethoxy-phenyl)-1-methyl-ethylcarbamoyl]-ethyl}-2-(tetrazol-1-ylmethoxy)-phenyl]-phosphonic acid
Type:
Small organic molecule
Emp. Form.:
C28H37N6O7P
Mol. Mass.:
600.6031
SMILES:
CC(C)(NC(=O)CCc1ccc(OCn2cnnn2)c(c1)P(O)(O)=O)c1ccc(OCC2CCCCC2)c(c1)C(N)=O
: