Target
Tyrosine-protein kinase Yes
Ligand
BDBM50103779
Substrate
Meas. Tech.
ChEBML_217596
IC50
>500000±n/a nM
Citation
 Kawahata, NYang, MGLuke, GPShakespeare, WCSundaramoorthi, RWang, YJohnson, DMerry, TViolette, SGuan, WBartlett, CSmith, JHatada, MLu, XDalgarno, DCEyermann, CJBohacek, RSSawyer, TK A novel phosphotyrosine mimetic 4'-carboxymethyloxy-3'-phosphonophenylalanine (Cpp): exploitation in the design of nonpeptide inhibitors of pp60(Src) SH2 domain. Bioorg Med Chem Lett 11:2319-23 (2001)  
Target
Name:
Tyrosine-protein kinase Yes
Synonyms:
Proto-oncogene c-Yes YES YES_HUMAN | p61-yes
Type:
Protein
Mol. Mass.:
60801.54
Organism:
Homo sapiens (Human)
Description:
P07947
Residue:
543
  
Inhibitor
Name:
BDBM50103779
Synonyms:
CHEMBL430825 | Trifluoro-methanesulfonic acid 4-{2-[1-(3-carbamoyl-4-cyclohexylmethoxy-phenyl)-1-methyl-ethylcarbamoyl]-ethyl}-2-phosphono-phenyl ester
Type:
Small organic molecule
Emp. Form.:
C27H34F3N2O9PS
Mol. Mass.:
650.601
SMILES:
CC(C)(NC(=O)CCc1ccc(OS(=O)(=O)C(F)(F)F)c(c1)P(O)(O)=O)c1ccc(OCC2CCCCC2)c(c1)C(N)=O
: