Target
Tyrosine-protein kinase Yes
Ligand
BDBM50103782
Substrate
Meas. Tech.
ChEBML_217596
IC50
110000±n/a nM
Citation
 Kawahata, NYang, MGLuke, GPShakespeare, WCSundaramoorthi, RWang, YJohnson, DMerry, TViolette, SGuan, WBartlett, CSmith, JHatada, MLu, XDalgarno, DCEyermann, CJBohacek, RSSawyer, TK A novel phosphotyrosine mimetic 4'-carboxymethyloxy-3'-phosphonophenylalanine (Cpp): exploitation in the design of nonpeptide inhibitors of pp60(Src) SH2 domain. Bioorg Med Chem Lett 11:2319-23 (2001)  
Target
Name:
Tyrosine-protein kinase Yes
Synonyms:
Proto-oncogene c-Yes YES YES_HUMAN | p61-yes
Type:
Protein
Mol. Mass.:
60801.54
Organism:
Homo sapiens (Human)
Description:
P07947
Residue:
543
  
Inhibitor
Name:
BDBM50103782
Synonyms:
(4-{2-Acetylamino-2-[(S)-1-(3-carbamoyl-4-cyclohexylmethoxy-phenyl)-ethylcarbamoyl]-ethyl}-2-phosphono-phenoxy)-acetic acid | CHEMBL76350
Type:
Small organic molecule
Emp. Form.:
C29H38N3O10P
Mol. Mass.:
619.5999
SMILES:
C[C@H](NC(=O)C(Cc1ccc(OCC(O)=O)c(c1)P(O)(O)=O)NC(C)=O)c1ccc(OCC2CCCCC2)c(c1)C(N)=O
: