Target
Proto-oncogene tyrosine-protein kinase Src
Ligand
BDBM50103788
Substrate
Meas. Tech.
ChEBML_202595
IC50
>500000±n/a nM
Citation
 Kawahata, NYang, MGLuke, GPShakespeare, WCSundaramoorthi, RWang, YJohnson, DMerry, TViolette, SGuan, WBartlett, CSmith, JHatada, MLu, XDalgarno, DCEyermann, CJBohacek, RSSawyer, TK A novel phosphotyrosine mimetic 4'-carboxymethyloxy-3'-phosphonophenylalanine (Cpp): exploitation in the design of nonpeptide inhibitors of pp60(Src) SH2 domain. Bioorg Med Chem Lett 11:2319-23 (2001)  
Target
Name:
Proto-oncogene tyrosine-protein kinase Src
Synonyms:
Calmodulin/Proto-oncogene tyrosine-protein kinase Src Proto-oncogene c-Src SRC SRC_HUMAN V-src sarcoma (Schmidt-Ruppin A-2) viral oncogene homolog (avian) p60-Src | pp60c-src
Type:
Protein
Mol. Mass.:
59838.60
Organism:
Homo sapiens (Human)
Description:
P12931
Residue:
536
  
Inhibitor
Name:
BDBM50103788
Synonyms:
(5-{2-[1-(3-Carbamoyl-4-cyclohexylmethoxy-phenyl)-1-methyl-ethylcarbamoyl]-ethyl}-2-hydroxy-phenyl)-phosphonic acid | CHEMBL76937
Type:
Small organic molecule
Emp. Form.:
C26H35N2O7P
Mol. Mass.:
518.5391
SMILES:
CC(C)(NC(=O)CCc1ccc(O)c(c1)P(O)(O)=O)c1ccc(OCC2CCCCC2)c(c1)C(N)=O
: