Target
Tyrosine-protein kinase JAK1
Ligand
BDBM50545944
Substrate
Meas. Tech.
ChEMBL_2013351 (CHEMBL4666929)
Ki
0.210000±n/a nM
Citation
 Zak, MHanan, EJLupardus, PBrown, DGRobinson, CSiu, MLyssikatos, JPRomero, FAZhao, GKellar, TMendonca, RRay, NCGoodacre, SCCrackett, PHMcLean, NHurley, CAYuen, PWCheng, YXLiu, XLiimatta, MKohli, PBNonomiya, JSalmon, GBuckley, GLloyd, JGibbons, PGhilardi, NKenny, JRJohnson, A Discovery of a class of highly potent Janus Kinase 1/2 (JAK1/2) inhibitors demonstrating effective cell-based blockade of IL-13 signaling. Bioorg Med Chem Lett 29:1522-1531 (2019)  
Target
Name:
Tyrosine-protein kinase JAK1
Synonyms:
JAK-1 JAK1A JAK1_HUMAN Janus kinase 1 (JAK1) | Janus kinase 1 JAK1
Type:
Protein
Mol. Mass.:
133293.73
Organism:
Homo sapiens (Human)
Description:
P23458
Residue:
1154
  
Inhibitor
Name:
BDBM50545944
Synonyms:
CHEMBL4744172
Type:
Small organic molecule
Emp. Form.:
C17H11ClF2N6O2
Mol. Mass.:
404.758
SMILES:
FC(F)Oc1ccc(Cl)cc1-c1n[nH]cc1NC(=O)c1cnn2cccnc12
: