Target
Tyrosine-protein kinase JAK2
Ligand
BDBM50545945
Substrate
Meas. Tech.
ChEMBL_2013357 (CHEMBL4666935)
Ki
0.088000±n/a nM
Citation
 Zak, MHanan, EJLupardus, PBrown, DGRobinson, CSiu, MLyssikatos, JPRomero, FAZhao, GKellar, TMendonca, RRay, NCGoodacre, SCCrackett, PHMcLean, NHurley, CAYuen, PWCheng, YXLiu, XLiimatta, MKohli, PBNonomiya, JSalmon, GBuckley, GLloyd, JGibbons, PGhilardi, NKenny, JRJohnson, A Discovery of a class of highly potent Janus Kinase 1/2 (JAK1/2) inhibitors demonstrating effective cell-based blockade of IL-13 signaling. Bioorg Med Chem Lett 29:1522-1531 (2019)  
Target
Name:
Tyrosine-protein kinase JAK2
Synonyms:
JAK-2 JAK2_HUMAN Janus kinase 2 (JAK2) | Janus kinase 2 (a protein tyrosine kinase)
Type:
Protein
Mol. Mass.:
130684.68
Organism:
Homo sapiens (Human)
Description:
O60674
Residue:
1132
  
Inhibitor
Name:
BDBM50545945
Synonyms:
CHEMBL4777342
Type:
Small organic molecule
Emp. Form.:
C18H13ClF2N6O2
Mol. Mass.:
418.785
SMILES:
Cn1cc(NC(=O)c2cnn3cccnc23)c(n1)-c1cc(Cl)ccc1OC(F)F
: