Target
Telomerase reverse transcriptase
Ligand
BDBM50104461
Substrate
Meas. Tech.
ChEBML_210074
IC50
>100000±n/a nM
Citation
 Sasaki, SEhara, TAlam, MRFujino, YHarada, NKimura, JNakamura, HMaeda, M Solid-Phase synthesis of a library constructed of aromatic phosphate, long alkyl chains and tryptophane components, and identification of potent dipeptide telomerase inhibitors. Bioorg Med Chem Lett 11:2581-4 (2001)  
Target
Name:
Telomerase reverse transcriptase
Synonyms:
EST2 TERT TRT
Type:
PROTEIN
Mol. Mass.:
127099.03
Organism:
Homo sapiens (Human)
Description:
ChEMBL_1447029
Residue:
1132
  
Inhibitor
Name:
BDBM50104461
Synonyms:
CHEMBL313922 | Phosphoric acid 6-[(R)-2-amino-3-(1H-indol-3-yl)-propionylamino]-hexyl ester 2-chloro-phenyl ester; compound with triethyl-amine
Type:
Small organic molecule
Emp. Form.:
C23H29ClN3O5P
Mol. Mass.:
493.92
SMILES:
N[C@H](Cc1c[nH]c2ccccc12)C(=O)NCCCCCCOP(O)(=O)Oc1ccccc1Cl
: