Target
Telomerase reverse transcriptase
Ligand
BDBM50104463
Substrate
Meas. Tech.
ChEBML_210074
IC50
>100000±n/a nM
Citation
 Sasaki, SEhara, TAlam, MRFujino, YHarada, NKimura, JNakamura, HMaeda, M Solid-Phase synthesis of a library constructed of aromatic phosphate, long alkyl chains and tryptophane components, and identification of potent dipeptide telomerase inhibitors. Bioorg Med Chem Lett 11:2581-4 (2001)  
Target
Name:
Telomerase reverse transcriptase
Synonyms:
EST2 TERT TRT
Type:
PROTEIN
Mol. Mass.:
127099.03
Organism:
Homo sapiens (Human)
Description:
ChEMBL_1447029
Residue:
1132
  
Inhibitor
Name:
BDBM50104463
Synonyms:
((R)-1-{12-[(2-Chloro-phenoxy)-hydroxy-phosphoryloxy]-dodecylcarbamoyl}-2-phenyl-ethyl)-carbamic acid benzyl ester; compound with triethyl-amine | CHEMBL86404
Type:
Small organic molecule
Emp. Form.:
C35H46ClN2O7P
Mol. Mass.:
673.176
SMILES:
OP(=O)(OCCCCCCCCCCCCNC(=O)[C@@H](Cc1ccccc1)NC(=O)OCc1ccccc1)Oc1ccccc1Cl
: