Target
Telomerase reverse transcriptase
Ligand
BDBM50104467
Substrate
Meas. Tech.
ChEBML_210074
IC50
12100±n/a nM
Citation
 Sasaki, SEhara, TAlam, MRFujino, YHarada, NKimura, JNakamura, HMaeda, M Solid-Phase synthesis of a library constructed of aromatic phosphate, long alkyl chains and tryptophane components, and identification of potent dipeptide telomerase inhibitors. Bioorg Med Chem Lett 11:2581-4 (2001)  
Target
Name:
Telomerase reverse transcriptase
Synonyms:
EST2 TERT TRT
Type:
PROTEIN
Mol. Mass.:
127099.03
Organism:
Homo sapiens (Human)
Description:
ChEMBL_1447029
Residue:
1132
  
Inhibitor
Name:
BDBM50104467
Synonyms:
CHEMBL437042 | {[(R)-1-{12-[(2-Chloro-phenoxy)-hydroxy-phosphoryloxy]-dodecylcarbamoyl}-2-(1H-indol-3-yl)-ethylcarbamoyl]-methyl}-carbamic acid benzyl ester; compound with triethyl-amine
Type:
Small organic molecule
Emp. Form.:
C39H50ClN4O8P
Mol. Mass.:
769.263
SMILES:
OP(=O)(OCCCCCCCCCCCCNC(=O)[C@@H](Cc1c[nH]c2ccccc12)NC(=O)CNC(=O)OCc1ccccc1)Oc1ccccc1Cl
: