Target
Telomerase reverse transcriptase
Ligand
BDBM50104474
Substrate
Meas. Tech.
ChEBML_210074
IC50
45200±n/a nM
Citation
 Sasaki, SEhara, TAlam, MRFujino, YHarada, NKimura, JNakamura, HMaeda, M Solid-Phase synthesis of a library constructed of aromatic phosphate, long alkyl chains and tryptophane components, and identification of potent dipeptide telomerase inhibitors. Bioorg Med Chem Lett 11:2581-4 (2001)  
Target
Name:
Telomerase reverse transcriptase
Synonyms:
EST2 TERT TRT
Type:
PROTEIN
Mol. Mass.:
127099.03
Organism:
Homo sapiens (Human)
Description:
ChEMBL_1447029
Residue:
1132
  
Inhibitor
Name:
BDBM50104474
Synonyms:
CHEMBL262163 | Phosphoric acid 12-[(R)-2-amino-3-(1H-indol-3-yl)-propionylamino]-dodecyl ester 2-chloro-phenyl ester; compound with triethyl-amine
Type:
Small organic molecule
Emp. Form.:
C29H41ClN3O5P
Mol. Mass.:
578.08
SMILES:
N[C@H](Cc1c[nH]c2ccccc12)C(=O)NCCCCCCCCCCCCOP(O)(=O)Oc1ccccc1Cl
: