Target
Telomerase reverse transcriptase
Ligand
BDBM50104479
Substrate
Meas. Tech.
ChEBML_210074
IC50
>100000±n/a nM
Citation
 Sasaki, SEhara, TAlam, MRFujino, YHarada, NKimura, JNakamura, HMaeda, M Solid-Phase synthesis of a library constructed of aromatic phosphate, long alkyl chains and tryptophane components, and identification of potent dipeptide telomerase inhibitors. Bioorg Med Chem Lett 11:2581-4 (2001)  
Target
Name:
Telomerase reverse transcriptase
Synonyms:
EST2 TERT TRT
Type:
PROTEIN
Mol. Mass.:
127099.03
Organism:
Homo sapiens (Human)
Description:
ChEMBL_1447029
Residue:
1132
  
Inhibitor
Name:
BDBM50104479
Synonyms:
CHEMBL421541 | [(R)-1-[(S)-1-{12-[(2-Chloro-phenoxy)-hydroxy-phosphoryloxy]-dodecylcarbamoyl}-2-(1H-indol-3-yl)-ethylcarbamoyl]-2-(1H-indol-2-yl)-ethyl]-carbamic acid tert-butyl ester; compound with triethyl-amine
Type:
Small organic molecule
Emp. Form.:
C45H59ClN5O8P
Mol. Mass.:
864.405
SMILES:
CC(C)(C)OC(=O)N[C@H](Cc1cc2ccccc2[nH]1)C(=O)N[C@@H](Cc1c[nH]c2ccccc12)C(=O)NCCCCCCCCCCCCOP(O)(=O)Oc1ccccc1Cl
: