Target
Telomerase reverse transcriptase
Ligand
BDBM50104480
Substrate
Meas. Tech.
ChEBML_210074
IC50
46900.0±n/a nM
Citation
 Sasaki, SEhara, TAlam, MRFujino, YHarada, NKimura, JNakamura, HMaeda, M Solid-Phase synthesis of a library constructed of aromatic phosphate, long alkyl chains and tryptophane components, and identification of potent dipeptide telomerase inhibitors. Bioorg Med Chem Lett 11:2581-4 (2001)  
Target
Name:
Telomerase reverse transcriptase
Synonyms:
EST2 TERT TRT
Type:
PROTEIN
Mol. Mass.:
127099.03
Organism:
Homo sapiens (Human)
Description:
ChEMBL_1447029
Residue:
1132
  
Inhibitor
Name:
BDBM50104480
Synonyms:
CHEMBL420795 | Phosphoric acid 2-chloro-phenyl ester 6-({1-[4-(2-{1-[3-(3-methyl-indol-1-yl)-propyl]-1H-indol-3-yl}-acetylamino)-butyryl]-pyrrolidine-2-carbonyl}-amino)-hexyl ester; compound with triethyl-amine
Type:
Small organic molecule
Emp. Form.:
C43H53ClN5O7P
Mol. Mass.:
818.337
SMILES:
Cc1cn(CCCn2cc(CC(=O)NCCCC(=O)N3CCCC3C(=O)NCCCCCCOP(O)(=O)Oc3ccccc3Cl)c3ccccc23)c2ccccc12
: