Target
Signal peptide peptidase-like 2A
Ligand
BDBM50546129
Substrate
Meas. Tech.
ChEMBL_2014323 (CHEMBL4667901)
IC50
840±n/a nM
Citation
 Velcicky, JMathison, CJNNikulin, VPflieger, DEpple, RAzimioara, MCow, CMichellys, PYRigollier, PBeisner, DRBodendorf, UGuerini, DLiu, BWen, BZaharevitz, SBrandl, T Discovery of Orally Active Hydroxyethylamine Based SPPL2a Inhibitors. ACS Med Chem Lett 10:887-892 (2019)  
Target
Name:
Signal peptide peptidase-like 2A
Synonyms:
3.4.23.- IMP3 PSL2 SPP-like 2A SPPL2A | Signal peptide peptidase-like 2A
Type:
PROTEIN
Mol. Mass.:
58152.61
Organism:
Homo sapiens
Description:
ChEMBL_117438
Residue:
520
  
Inhibitor
Name:
BDBM50546129
Synonyms:
CHEMBL4785324
Type:
Small organic molecule
Emp. Form.:
C20H23N3O3S2
Mol. Mass.:
417.545
SMILES:
N[C@H]([C@@H](O)CN(C1CCC1)S(=O)(=O)c1ccc2scnc2c1)c1ccccc1
: