Target
Presenilin-1
Ligand
BDBM50546125
Substrate
Meas. Tech.
ChEMBL_2014327 (CHEMBL4667905)
IC50
2100±n/a nM
Citation
 Velcicky, JMathison, CJNNikulin, VPflieger, DEpple, RAzimioara, MCow, CMichellys, PYRigollier, PBeisner, DRBodendorf, UGuerini, DLiu, BWen, BZaharevitz, SBrandl, T Discovery of Orally Active Hydroxyethylamine Based SPPL2a Inhibitors. ACS Med Chem Lett 10:887-892 (2019)  
Target
Name:
Presenilin-1
Synonyms:
3.4.23.- Gamma-Secretase Subunit Presenilin-1 PS1 PSEN1 PSNL1 Presenilin-1 CTF12 Protein S182
Type:
Mol. Mass.:
52657.13
Organism:
Homo sapiens (Human)
Description:
P49768
Residue:
467
  
Inhibitor
Name:
BDBM50546125
Synonyms:
CHEMBL4792187
Type:
Small organic molecule
Emp. Form.:
C22H28Cl2N2O3S
Mol. Mass.:
471.44
SMILES:
N[C@H]([C@@H](O)CN(C1CCCCCC1)S(=O)(=O)c1ccc(Cl)c(Cl)c1)c1ccccc1
: