Target
Presenilin-1
Ligand
BDBM50546130
Substrate
Meas. Tech.
ChEMBL_2014327 (CHEMBL4667905)
IC50
3700±n/a nM
Citation
 Velcicky, JMathison, CJNNikulin, VPflieger, DEpple, RAzimioara, MCow, CMichellys, PYRigollier, PBeisner, DRBodendorf, UGuerini, DLiu, BWen, BZaharevitz, SBrandl, T Discovery of Orally Active Hydroxyethylamine Based SPPL2a Inhibitors. ACS Med Chem Lett 10:887-892 (2019)  
Target
Name:
Presenilin-1
Synonyms:
3.4.23.- Gamma-Secretase Subunit Presenilin-1 PS1 PSEN1 PSNL1 Presenilin-1 CTF12 Protein S182
Type:
Mol. Mass.:
52657.13
Organism:
Homo sapiens (Human)
Description:
P49768
Residue:
467
  
Inhibitor
Name:
BDBM50546130
Synonyms:
CHEMBL4762492
Type:
Small organic molecule
Emp. Form.:
C23H32N2O3S
Mol. Mass.:
416.577
SMILES:
CC(C)(C)c1cccc(c1)S(=O)(=O)N(C[C@H](O)[C@@H](N)c1ccccc1)C1CCC1
: