Target
Aldo-keto reductase family 1 member C1
Ligand
BDBM50237590
Substrate
Meas. Tech.
ChEMBL_2014949 (CHEMBL4668527)
IC50
6860±n/a nM
Citation
 Liu, YHe, SChen, YLiu, YFeng, FLiu, WGuo, QZhao, LSun, H Overview of AKR1C3: Inhibitor Achievements and Disease Insights. J Med Chem 63:11305-11329 (2020)  
Target
Name:
Aldo-keto reductase family 1 member C1
Synonyms:
20-alpha-HSD AK1C1_HUMAN Aldo-keto reductase family 1 member C1 (AK1C1) Aldo-keto reductase family 1 member C1 (AKR1C1) DDH High-affinity hepatic bile acid-binding protein | Trans-1,2-dihydrobenzene-1,2-diol dehydrogenase
Type:
Enzyme
Mol. Mass.:
36793.97
Organism:
Homo sapiens (Human)
Description:
Recombinant AKR1C1 enzyme was expressed in E. coli.
Residue:
323
  
Inhibitor
Name:
BDBM50237590
Synonyms:
Amaryl Glimepiride Niddaryl
Type:
Small organic molecule
Emp. Form.:
C24H34N4O5S
Mol. Mass.:
490.616
SMILES:
CCC1=C(C)CN(C(=O)NCCc2ccc(cc2)S(=O)(=O)NC(=O)N[C@H]2CC[C@H](C)CC2)C1=O
: