Target
NACHT, LRR and PYD domains-containing protein 3
Ligand
BDBM50547438
Substrate
Meas. Tech.
ChEMBL_2018189 (CHEMBL4671767)
IC50
35±n/a nM
Citation
 Agarwal, SPethani, JPShah, HAVyas, VSasane, SBhavsar, HBandyopadhyay, DGiri, PViswanathan, KJain, MRSharma, R Identification of a novel orally bioavailable NLRP3 inflammasome inhibitor. Bioorg Med Chem Lett 30:0 (2020)  
Target
Name:
NACHT, LRR and PYD domains-containing protein 3
Synonyms:
C1orf7 NALP3 NLRP3 protein PYPAF1
Type:
Enzyme Catalytic Domain
Mol. Mass.:
118173.88
Organism:
Homo sapiens (Human)
Description:
Q96P20
Residue:
1036
  
Inhibitor
Name:
BDBM50547438
Synonyms:
CHEMBL4752523
Type:
Small organic molecule
Emp. Form.:
C18H19N3O3S2
Mol. Mass.:
389.492
SMILES:
O=C(Nc1c2CCCc2cc2CCCc12)NS(=O)(=O)\C=C\c1nccs1
: