Target
Melanocortin receptor 4
Ligand
BDBM50105892
Substrate
Meas. Tech.
ChEMBL_220873 (CHEMBL824629)
Ki
0.280000±n/a nM
Citation
 Bednarek, MAMacNeil, TKalyani, RNTang, RVan der Ploeg, LHWeinberg, DH Selective, high affinity peptide antagonists of alpha-melanotropin action at human melanocortin receptor 4: their synthesis and biological evaluation in vitro. J Med Chem 44:3665-72 (2001)  
Target
Name:
Melanocortin receptor 4
Synonyms:
MC4-R MC4R_HUMAN Melanocortin receptor 4 (MC-4) Melanocortin receptor 4 (MC4R)
Type:
Enzyme
Mol. Mass.:
36949.50
Organism:
Homo sapiens (Human)
Description:
P32245
Residue:
332
  
Inhibitor
Name:
BDBM50105892
Synonyms:
12-(2-Acetylamino-hexanoylamino)-6-(3-guanidino-propyl)-3-(1H-indol-3-ylmethyl)-9-naphthalen-2-ylmethyl-2,5,8,11,14-pentaoxo-1,4,7,10,15pentaaza-cycloicosane-20-carboxylic acid | CHEMBL331259
Type:
Small organic molecule
Emp. Form.:
C48H64N12O8
Mol. Mass.:
937.0974
SMILES:
CCCC[C@H](NC(C)=O)C(=O)N[C@H]1CC(=O)NCCCC[C@@H](NC(=O)[C@@H](Cc2c[nH]c3ccccc23)NC(=O)[C@H](CCCNC(N)=N)NC(=O)[C@H](Cc2ccc3ccccc3c2)NC1=O)C(N)=O
: