Target
5-hydroxytryptamine receptor 1A
Ligand
BDBM433527
Substrate
Meas. Tech.
ChEMBL_2016819 (CHEMBL4670397)
Ki
0.060256±n/a nM
Citation
 Sniecikowska, JGluch-Lutwin, MBucki, AWi?ckowska, ASiwek, AJastrzebska-Wiesek, MPartyka, AWilczy?ska, DPytka, KLatacz, GPrzejczowska-Pomierny, KWyska, EWeso?owska, APaw?owski, MNewman-Tancredi, AKolaczkowski, M Discovery of Novel pERK1/2- or ?-Arrestin-Preferring 5-HT J Med Chem 63:10946-10971 (2020) Target
Name:
5-hydroxytryptamine receptor 1A
Synonyms:
5-HT-1A 5-hydroxytryptamine receptor 1A (5-HT-1A) ADRB2RL1 Dopamine D2 receptor and serotonin 1a receptor HTR1A | Serotonin receptor 1A
Type:
Mol. Mass.:
46122.49
Organism:
Homo sapiens (Human)
Description:
Residue:
422
  
Inhibitor
Name:
BDBM433527
Synonyms:
US10562853, Compound 48
Type:
Small organic molecule
Emp. Form.:
C22H24ClF2N3O3
Mol. Mass.:
451.894
SMILES:
NC(=O)c1ccccc1OCCNCC1(F)CCN(CC1)C(=O)c1ccc(F)c(Cl)c1
: