Target
5-hydroxytryptamine receptor 1A
Ligand
BDBM433523
Substrate
Meas. Tech.
ChEMBL_2016819 (CHEMBL4670397)
Ki
0.000158±n/a nM
Citation
 Sniecikowska, JGluch-Lutwin, MBucki, AWi?ckowska, ASiwek, AJastrzebska-Wiesek, MPartyka, AWilczy?ska, DPytka, KLatacz, GPrzejczowska-Pomierny, KWyska, EWeso?owska, APaw?owski, MNewman-Tancredi, AKolaczkowski, M Discovery of Novel pERK1/2- or ?-Arrestin-Preferring 5-HT J Med Chem 63:10946-10971 (2020) Target
Name:
5-hydroxytryptamine receptor 1A
Synonyms:
5-HT-1A 5-hydroxytryptamine receptor 1A (5-HT-1A) ADRB2RL1 Dopamine D2 receptor and serotonin 1a receptor HTR1A | Serotonin receptor 1A
Type:
Mol. Mass.:
46122.49
Organism:
Homo sapiens (Human)
Description:
Residue:
422
  
Inhibitor
Name:
BDBM433523
Synonyms:
US10562853, Compound 44
Type:
Small organic molecule
Emp. Form.:
C23H24ClF2N3O2
Mol. Mass.:
447.905
SMILES:
Fc1ccc(cc1Cl)C(=O)N1CCC(F)(CNCCOc2cccc3[nH]ccc23)CC1
: