Target
Prostaglandin D2 receptor
Ligand
BDBM50035622
Substrate
Meas. Tech.
ChEMBL_158168 (CHEMBL766131)
IC50
4500±n/a nM
Citation
 Soper, DLMilbank, JBMieling, GEDirr, MJKende, ASCooper, RJee, WSYao, WChen, JLBodman, MLundy, MWDe, BStella, MEEbetino, FHWang, YdeLong, MAWos, JA Synthesis and biological evaluation of prostaglandin-F alkylphosphinic acid derivatives as bone anabolic agents for the treatment of osteoporosis. J Med Chem 44:4157-69 (2001)  
Target
Name:
Prostaglandin D2 receptor
Synonyms:
PD2R_HUMAN Prostaglandin D2 Prostanoid DP receptor
Type:
Enzyme
Mol. Mass.:
40288.87
Organism:
Homo sapiens (Human)
Description:
Q13258
Residue:
359
  
Inhibitor
Name:
BDBM50035622
Synonyms:
(5Z,13E,15S)-9alpha,11alpha,15-trihydroxyprosta-5,13-dien-1-oic acid DINOPROST l-PGF2-alpha prostaglandin F2alpha
Type:
Small organic molecule
Emp. Form.:
C20H34O5
Mol. Mass.:
354.481
SMILES:
CCCCC[C@H](O)\C=C\[C@H]1[C@H](O)C[C@H](O)[C@@H]1C\C=C/CCCC(O)=O
: