Target
Glycogen synthase kinase-3 beta
Ligand
BDBM498707
Substrate
Meas. Tech.
ChEMBL_2019377 (CHEMBL4672955)
Ki
1.4±n/a nM
Citation
 Sabnis, RW Novel CDK2 Inhibitors for Treating Cancer. ACS Med Chem Lett 11:2346-2347 (2020)  
Target
Name:
Glycogen synthase kinase-3 beta
Synonyms:
GSK-3 beta GSK3B Glycogen synthase kinase 3 beta (GSK3B) Glycogen synthase kinase-3 beta (GSK-3B) Glycogen synthase kinase-3 beta (GSK3B) Glycogen synthase kinase-3beta (GSK3B) | Serine/threonine-protein kinase GSK3B
Type:
Enzyme
Mol. Mass.:
46756.38
Organism:
Homo sapiens (Human)
Description:
P49841
Residue:
420
  
Inhibitor
Name:
BDBM498707
Synonyms:
(1R,3S)-3-(3-{[(6- methoxypyridin-3- yl)acetyl]amino}-1H-pyrazol-5- yl)cyclopentyl [(2$#958;)-2- (hydroxymethyl)butyl] carbamate - Isomer A US11014911, Example 533 | US11718603, Example 533
Type:
Small organic molecule
Emp. Form.:
C22H31N5O5
Mol. Mass.:
445.512
SMILES:
CCC(CO)CNC(=O)O[C@@H]1CC[C@@H](C1)c1cc(NC(=O)Cc2ccc(OC)nc2)n[nH]1
: