Target
Serine/threonine-protein kinase/endoribonuclease IRE1
Ligand
BDBM50547988
Substrate
Meas. Tech.
ChEMBL_2019487 (CHEMBL4673065)
IC50
22±n/a nM
Citation
 Beveridge, REWallweber, HAAshkenazi, ABeresini, MClark, KRGibbons, PGhiro, EKaufman, SLarivée, ALeblanc, MLeclerc, JPLemire, ALy, CRudolph, JSchwarz, JBSrivastava, SWang, WZhao, LBraun, MG Identification of BRaf-Sparing Amino-Thienopyrimidines with Potent IRE1? Inhibitory Activity. ACS Med Chem Lett 11:2389-2396 (2020)  
Target
Name:
Serine/threonine-protein kinase/endoribonuclease IRE1
Synonyms:
ERN1 Endoplasmic reticulum-to-nucleus signaling 1 IRE1 Inositol requiring enzyme 1 (IRE-1alpha) Inositol-requiring protein 1 Ire1-alpha Serine/threonine-protein kinase/endoribonuclease IRE1 hIRE1p
Type:
Enzyme
Mol. Mass.:
109731.20
Organism:
Homo sapiens (Human)
Description:
O75460
Residue:
977
  
Inhibitor
Name:
BDBM50547988
Synonyms:
CHEMBL4781285
Type:
Small organic molecule
Emp. Form.:
C25H23Cl2FN6O3S2
Mol. Mass.:
609.523
SMILES:
N[C@H]1CC[C@@H](CC1)Nc1ncnc2c(csc12)C(=O)Nc1c(Cl)ccc(NS(=O)(=O)c2ccccc2Cl)c1F
: