Target
Interstitial collagenase
Ligand
BDBM50107573
Substrate
Meas. Tech.
ChEBML_106318
Ki
12800±n/a nM
Citation
 Yao, WChao, MWasserman, ZRLiu, RQCovington, MBNewton, RChrist, DWexler, RRDecicco, CP Potent P1' biphenylmethyl substituted aggrecanase inhibitors. Bioorg Med Chem Lett 12:101-4 (2001)  
Target
Name:
Interstitial collagenase
Synonyms:
CLG MMP1 Matrix metalloproteinase-1 | Matrix metalloproteinase-1 (MMP-1)
Type:
Enzyme
Mol. Mass.:
54010.26
Organism:
Homo sapiens (Human)
Description:
P03956
Residue:
469
  
Inhibitor
Name:
BDBM50107573
Synonyms:
(2R)-2-[4-(1,3-benzodioxol-5-yl)benzyl]-N~4~-hydroxy-N~1~-[(1S,2R)-2-hydroxy-2,3-dihydro-1H-inden-1-yl]butanediamide CHEMBL8432
Type:
Small organic molecule
Emp. Form.:
C27H26N2O6
Mol. Mass.:
474.5051
SMILES:
ONC(=O)C[C@@H](Cc1ccc(cc1)-c1ccc2OCOc2c1)C(=O)N[C@@H]1[C@H](O)Cc2ccccc12
: