Target
Transient receptor potential cation channel subfamily V member 1
Ligand
BDBM50318484
Substrate
Meas. Tech.
ChEMBL_2022067 (CHEMBL4675880)
EC50
4100±n/a nM
Citation
 Chianese, GLopatriello, ASchiano-Moriello, ACaprioglio, DMattoteia, DBenetti, ECiceri, DArnoldi, LDe Combarieu, EVitale, RMAmodeo, PAppendino, GDe Petrocellis, LTaglialatela-Scafati, O Cannabitwinol, a Dimeric Phytocannabinoid from Hemp,  J Nat Prod 83:2727-2736 (2020)  
Target
Name:
Transient receptor potential cation channel subfamily V member 1
Synonyms:
Capsaicin receptor Osm-9-like TRP channel 1 TRPV1_HUMAN Transient receptor potential cation channel subfamily V member 1 (TRPV1) Transient receptor potential cation channel subfamily V member 1(TRPV1) Vanilloid VR1 Vanilloid receptor 1 Vanilloid receptor 1 (VRI/TRPV1)
Type:
Protein
Mol. Mass.:
94960.75
Organism:
Homo sapiens (Human)
Description:
Q8NER1
Residue:
839
  
Inhibitor
Name:
BDBM50318484
Synonyms:
2-((1R,6R)-6-Isopropenyl-3-methyl-cyclohex-2-enyl)-5-pentyl-benzene-1,3-diol CHEMBL190461
Type:
Small organic molecule
Emp. Form.:
C21H30O2
Mol. Mass.:
314.4617
SMILES:
CCCCCc1cc(O)c([C@@H]2C=C(C)CC[C@H]2C(C)=C)c(O)c1
: