Target
D(2) dopamine receptor
Ligand
BDBM50107880
Substrate
Meas. Tech.
ChEMBL_62391 (CHEMBL672343)
Ki
265±n/a nM
Citation
 Haadsma-Svensson, SRCleek, KADinh, DMDuncan, JNHaber, CLHuff, RMLajiness, MENichols, NFSmith, MWSvensson, KAZaya, MJCarlsson, ALin, CH Dopamine D(3) receptor antagonists. 1. Synthesis and structure-activity relationships of 5,6-dimethoxy-N-alkyl- and N-alkylaryl-substituted 2-aminoindans. J Med Chem 44:4716-32 (2001)  
Target
Name:
D(2) dopamine receptor
Synonyms:
DOPAMINE D2 DOPAMINE D2 Short Dopamine D2 receptor Drd2
Type:
G Protein-Coupled Receptor (GPCR)
Mol. Mass.:
50931.60
Organism:
Rattus norvegicus (rat)
Description:
P61169
Residue:
444
  
Inhibitor
Name:
BDBM50107880
Synonyms:
4-{2-[(5,6-Dimethoxy-indan-2-yl)-propyl-amino]-ethyl}-thiazol-2-ylamine | CHEMBL141614
Type:
Small organic molecule
Emp. Form.:
C19H27N3O2S
Mol. Mass.:
361.502
SMILES:
CCCN(CCc1csc(N)n1)C1Cc2cc(OC)c(OC)cc2C1
: