Target
Geranylgeranyl transferase type-1 subunit beta/Protein farnesyltransferase/geranylgeranyltransferase type-1 subunit alpha
Ligand
BDBM50048956
Substrate
Meas. Tech.
ChEMBL_71959 (CHEMBL686124)
IC50
>100000±n/a nM
Citation
 Ohkanda, JLockman, JWKothare, MAQian, YBlaskovich, MASebti, SMHamilton, AD Design and synthesis of potent nonpeptidic farnesyltransferase inhibitors based on a terphenyl scaffold. J Med Chem 45:177-88 (2001)  
Target
Name:
Geranylgeranyl transferase type-1 subunit beta/Protein farnesyltransferase/geranylgeranyltransferase type-1 subunit alpha
Synonyms:
Geranylgeranyl transferase type I Geranylgeranyl transferase type I beta/Protein farnesyltransferase/geranylgeranyltransferase type I alpha subunit
Type:
Mol. Mass.:
Description:
ASSAY_ID of EBI is 70196
Components:
This complex has 2 components.
Component 1
Name:
Protein farnesyltransferase/geranylgeranyltransferase type-1 subunit alpha
Synonyms:
CAAX farnesyltransferase alpha subunit FNTA_HUMAN FTase-alpha Geranylgeranyl Transferase (GGTase-I) Chain A Protein Farnesyltransferase (PFT) Chain A Protein farnesyltransferase Protein farnesyltransferase/geranylgeranyltransferase type I alpha subunit | Ras proteins prenyltransferase alpha
Type:
Enzyme
Mol. Mass.:
44392.46
Organism:
Homo sapiens (Human)
Description:
Recombinant human FTase.
Residue:
379
  
Component 2
Name:
Geranylgeranyl transferase type-1 subunit beta
Synonyms:
2.5.1.59 Geranylgeranyl transferase type I Geranylgeranyl transferase type I subunit beta PGGT1B Protein farnesyl/geranylgeranyl transferase | Type I protein geranyl-geranyltransferase subunit beta
Type:
Mol. Mass.:
42369.84
Organism:
Homo sapiens (Human)
Description:
Residue:
377
  
Inhibitor
Name:
BDBM50048956
Synonyms:
(R)-2-Amino-3-(3'-methyl-biphenyl-4-ylamino)-propane-1-thiol CHEMBL292164
Type:
Small organic molecule
Emp. Form.:
C16H20N2S
Mol. Mass.:
272.408
SMILES:
Cc1cccc(c1)-c1ccc(NC[C@@H](N)CS)cc1
: