Target
Solute carrier organic anion transporter family member 1B3
Ligand
BDBM207624
Substrate
Meas. Tech.
ChEMBL_2024650 (CHEMBL4678463)
IC50
19400±n/a nM
Citation
 Wang, HRen, BLiu, YJiang, BGuo, YWei, MLuo, LKuang, XQiu, MLv, LXu, HQi, RYan, HXu, DWang, ZHuo, CXZhu, YZhao, YWu, YQin, ZSu, DTang, TWang, FSun, XFeng, YPeng, HWang, XGao, YLiu, YGong, WYu, FLiu, XWang, LZhou, C Discovery of Pamiparib (BGB-290), a Potent and Selective Poly (ADP-ribose) Polymerase (PARP) Inhibitor in Clinical Development. J Med Chem 63:15541-15563 (2020)  
Target
Name:
Solute carrier organic anion transporter family member 1B3
Synonyms:
LST2 OATP8 SLC21A8 SO1B3_HUMAN Solute carrier organic anion transporter family member 1B3 (OATP1B3)
Type:
Protein
Mol. Mass.:
77425.75
Organism:
Homo sapiens (Human)
Description:
Q9NPD5
Residue:
702
  
Inhibitor
Name:
BDBM207624
Synonyms:
US10501467, Example 69 US9617273, Example 69
Type:
Small organic molecule
Emp. Form.:
C16H15FN4O
Mol. Mass.:
298.3149
SMILES:
C[C@]12CCCN1Cc1n[nH]c(=O)c3cc(F)cc4[nH]c2c1c34
: