Target
Solute carrier family 22 member 6
Ligand
BDBM207624
Substrate
Meas. Tech.
ChEMBL_2024651 (CHEMBL4678464)
IC50
47800±n/a nM
Citation
 Wang, HRen, BLiu, YJiang, BGuo, YWei, MLuo, LKuang, XQiu, MLv, LXu, HQi, RYan, HXu, DWang, ZHuo, CXZhu, YZhao, YWu, YQin, ZSu, DTang, TWang, FSun, XFeng, YPeng, HWang, XGao, YLiu, YGong, WYu, FLiu, XWang, LZhou, C Discovery of Pamiparib (BGB-290), a Potent and Selective Poly (ADP-ribose) Polymerase (PARP) Inhibitor in Clinical Development. J Med Chem 63:15541-15563 (2020)  
Target
Name:
Solute carrier family 22 member 6
Synonyms:
OAT1 PAH transporter Renal organic anion transporter 1 SLC22A6 hPAHT | hROAT1
Type:
PROTEIN
Mol. Mass.:
61831.78
Organism:
Homo sapiens (Human)
Description:
ChEMBL_1487359
Residue:
563
  
Inhibitor
Name:
BDBM207624
Synonyms:
US10501467, Example 69 US9617273, Example 69
Type:
Small organic molecule
Emp. Form.:
C16H15FN4O
Mol. Mass.:
298.3149
SMILES:
C[C@]12CCCN1Cc1n[nH]c(=O)c3cc(F)cc4[nH]c2c1c34
: