Target
Poly [ADP-ribose] polymerase 1
Ligand
BDBM207624
Substrate
Meas. Tech.
ChEMBL_2024728 (CHEMBL4678541)
IC50
1.3±n/a nM
Citation
 Wang, HRen, BLiu, YJiang, BGuo, YWei, MLuo, LKuang, XQiu, MLv, LXu, HQi, RYan, HXu, DWang, ZHuo, CXZhu, YZhao, YWu, YQin, ZSu, DTang, TWang, FSun, XFeng, YPeng, HWang, XGao, YLiu, YGong, WYu, FLiu, XWang, LZhou, C Discovery of Pamiparib (BGB-290), a Potent and Selective Poly (ADP-ribose) Polymerase (PARP) Inhibitor in Clinical Development. J Med Chem 63:15541-15563 (2020)  
Target
Name:
Poly [ADP-ribose] polymerase 1
Synonyms:
(ARTD1 or PARP1) 2.4.2.30 ADPRT ARTD1 Human diphtheria toxin-like ADP-ribosyltransferase (ARTD1 or PARP1) NT-PARP-1 PARP1 PPOL Poly [ADP-ribose] polymerase 1 (PARP) Poly [ADP-ribose] polymerase 1 (PARP1) Poly [ADP-ribose] polymerase 1, 28-kDa form Poly [ADP-ribose] polymerase 1, processed C-terminus Poly [ADP-ribose] polymerase-1 Poly(ADP-ribose) polymerase-1 (ARTD1/PARP1) Protein poly-ADP-ribosyltransferase PARP1 | Synonyms=ADPRT
Type:
Mol. Mass.:
113114.22
Organism:
Homo sapiens (Human)
Description:
P09874
Residue:
1014
  
Inhibitor
Name:
BDBM207624
Synonyms:
US10501467, Example 69 US9617273, Example 69
Type:
Small organic molecule
Emp. Form.:
C16H15FN4O
Mol. Mass.:
298.3149
SMILES:
C[C@]12CCCN1Cc1n[nH]c(=O)c3cc(F)cc4[nH]c2c1c34
: